BDBM414521 N-(5-(5-chloro-4-(1-methyl-1H-pyrrolo[2,3-b]pyridin-5-yl)pyrimidin-2-amino)-2-(4-(dimethylamino)piperidin-1-yl)-4-methoxyphenyl)acrylamide ::US10435400, Compound Z-2
SMILES COc1cc(N2CCC(CC2)N(C)C)c(NC(=O)C=C)cc1Nc1ncc(Cl)c(n1)-c1cnc2n(C)ccc2c1
InChI Key InChIKey=UVHIEUQSBNAGDC-UHFFFAOYSA-N
Data  2 IC50
  Tab Delimited (TSV)   2D SDfile   Computed 3D by Vconf -m prep SDfile
Find this compound or compounds like it in BindingDB:
Activity Spreadsheet -- Enzyme Inhibition Constant Data from BindingDB
Found 1 hit for monomerid = 414521
TargetEpidermal growth factor receptor [T790M,L858R](Homo sapiens (Human))
Shanghai Haiyan Pharmaceutical Technology
US Patent
LigandPNGBDBM414521(N-(5-(5-chloro-4-(1-methyl-1H-pyrrolo[2,3-b]pyridi...)
Affinity DataIC50:  17nM. Assay description: The inhibitory effects of compounds to be tested on double mutant EGFR kinase (EGFR T790M/L858R Kinase) (Invitrogen, PV4879) and wild-type EGFR kinas...
Ligand InfoPC cidPC sid
In DepthDetails US Patent